{"text_format":"1","workbook":"xlsx","n_sheets":4,"sheets":["Chart","MainData","APIData","Formatting"],"not_rendered":{"charts":1,"images":5,"macros":1,"external_links":0,"defined_names":96,"comments":0,"pivot_tables":0},"unopened":[],"bounds":{"document_bytes":16777216,"sheet_cells":100000,"rows_first":2000,"rows_last":500,"rows_between":2000,"halvings":0,"cell_chars":16384,"cell_head_chars":4096},"cells_cut":0,"cells_raw":0,"read":"whole","date_system":"1900"}

{"sheet":"Chart","index":0,"n_rows":15,"n_cols":12,"rows_kept":15,"cut":false,"hidden":false,"merged":[[4,6,5,7],[4,3,4,4]]}
[null,null,{"$f":"CONCATENATE(\"Template Version =\",\" \",ASPXVer)","v":"Template Version = APIBufferReport2b"},"Template saved on",{"$f":"TemplateSaveDate","v":"2023-05-17T14:04:29"}]
[]
[null,null,null,null,null,null,null,null,null,"* Click once to connect the buffer chart to your Playbook site."]
[null,null,"Configuration Settings:",null,null,null,"Select Milestones/Tasks to Track:",null,null,"Trajectory Periods:"]
[null,null,"Buffer Report:","XP 2000 - Prototype 1 ready for testing",null,null,{"$f":"CONCATENATE(\"Only milestones that have appeared on or after \",TEXT(Formatting!Q2,DateFormatText),\" are listed.\")","v":"Only milestones that have appeared on or after 7/11/2023 are listed."},null,null,{"$f":"CONCATENATE(\"Min (\",TEXT(WORKDAY(DateRun,-K5),DateFormatText),\")\")","v":"Min (5/10/2023)"},5,"days"]
[null,null,"Report Type:",null,null,null,null,null,null,{"$f":"CONCATENATE(\"Max (\",TEXT(WORKDAY(DateRun,-K6),DateFormatText),\")\")","v":"Max (5/3/2023)"},10,"days"]
[null,null,null,null,null,null,null,null,null,"Specific Date","2017-08-08"]
[null,null,"Located…"]
[]
[]
[null,null,"Chart Settings:",null,null,null,"Select Options to Show:",null,null,"Calculated Status Dates (today)"]
[null,null,"Plot Buffer Use Every:",1,"weekdays",null,null,null,null,"OK → Warning",{"$f":"WORKDAY(BufferStartDate,Formatting!I4+(TODAY()-ProjectStartDate)*(Formatting!I5-Formatting!I4)/(BufferEndDate-ProjectStartDate))","v":"2023-07-13"}]
[null,null,"Number of Days to Show Above Buffer:",0,{"$f":"\"weekdays\n(\"&MaxDaysAboveBuffer &\" to show all)\"","v":"weekdays\n(-14 to show all)"},null,null,null,null,"Warning → Danger",{"$f":"WORKDAY(BufferStartDate,Formatting!J4+(TODAY()-ProjectStartDate)*(Formatting!J5-Formatting!J4)/(BufferEndDate-ProjectStartDate))","v":"2023-07-17"}]
[null,null,"Number of Days to Show Below Zero:",0,{"$f":"\"weekdays\n(\"&-MinDaysBelowZero &\" to show all)\"","v":"weekdays\n(0 to show all)"}]
[null,null,"Date Format:",{"$f":"TODAY()","v":"2023-05-17"}]

{"sheet":"MainData","index":1,"n_rows":57,"n_cols":42,"rows_kept":57,"cut":false,"hidden":true,"merged":[]}
["Reporting Date","Days From Start","Ahead","On Track","Some Risk","High Risk","Behind","Milestone Dates","Impact Reasons","Impact","TBD2","GridlineY","_Finish Line","Prototype 1 ready for testing","Column15","Column16","Column17","Column18","Column19","Column20","Column21","Column22","Column23","Column24","Column25","Column26","Column27","Column28","Column29","Column30","Column31","Column32","Column33","Column34","Column35","Column36","Column37","Column38","Column39","Column40","Column41","Column42"]
["2023-05-17",0,0,2,2,10,2,"11-Jul-23\n",null,null,null,null,null,0]
["2023-05-18",1,null,null,null,null,null,""]
["2023-05-19",2,null,null,null,null,null,""]
["2023-05-22",3,null,null,null,null,null,""]
["2023-05-23",4,null,null,null,null,null,""]
["2023-05-24",5,null,null,null,null,null,""]
["2023-05-25",6,null,null,null,null,null,""]
["2023-05-26",7,null,null,null,null,null,""]
["2023-05-29",8,null,null,null,null,null,""]
["2023-05-30",9,null,null,null,null,null,""]
["2023-05-31",10,null,null,null,null,null,""]
["2023-06-01",11,null,null,null,null,null,""]
["2023-06-02",12,null,null,null,null,null,""]
["2023-06-05",13,null,null,null,null,null,""]
["2023-06-06",14,null,null,null,null,null,""]
["2023-06-07",15,null,null,null,null,null,""]
["2023-06-08",16,null,null,null,null,null,""]
["2023-06-09",17,null,null,null,null,null,""]
["2023-06-12",18,null,null,null,null,null,""]
["2023-06-13",19,null,null,null,null,null,""]
["2023-06-14",20,null,null,null,null,null,""]
["2023-06-15",21,null,null,null,null,null,""]
["2023-06-16",22,null,null,null,null,null,""]
["2023-06-19",23,null,null,null,null,null,""]
["2023-06-20",24,null,null,null,null,null,""]
["2023-06-21",25,null,null,null,null,null,""]
["2023-06-22",26,null,null,null,null,null,""]
["2023-06-23",27,null,null,null,null,null,""]
["2023-06-26",28,null,null,null,null,null,""]
{"$rows_left_out":28}
{"sheet":"APIData","index":2,"n_rows":60,"n_cols":43,"rows_kept":60,"cut":false,"hidden":true,"merged":[]}
["A","B","C","D","E","F","G","H","I","J","K","L","M","N","O","P","Q","R","S","T","U","V","W","X","Y","Z","AA","AB","AC","AD","AE","AF","AG","AH","AI","AJ","AK","AL","AM","AN","AO","AP","AQ"]
[1,"Report Name","Message","Time Run","Finish","Tracking Start Date","Buffer Start Date","Buffer End Date","Buffer Duration","Green on Day0","Red on Last Day","Warning Size","Number of Tracks","Latest Milestone","Latest Milestone Date","Buffer Used","NumOfErrors","WarningScore","Tasks with Warnings"]
[2,"XP 2000 - Prototype 1 ready for testing",null,"2023-05-17 16:44:15","","2023-05-17","2023-07-12","2023-07-31","14","2","2","2","1","Prototype 1 ready for testing","2023-07-11",null,"0","3","Bring-up/Smoke test 1st proto (Critical / Unassigned)\rAcquire parts, kit, send to supplier: Pwr Board (Near Critical / Planned Out of Date -1 d)"]
[3,"Reporting Date","Days From Start","Ahead","On Track","Some Risk","High Risk","Behind","Milestone Dates","Impact Reasons","Impact","TBD2","GridlineY","_Finish Line","Prototype 1 ready for testing"]
[4,"2023-05-17","0","0","2","2","10","2","11-Jul-23\n",null,null,null,null,null,"0"]
[5,"2023-05-18","1",null,null,null,null,null,""]
[6,"2023-05-19","2",null,null,null,null,null,""]
[7,"2023-05-22","3",null,null,null,null,null,""]
[8,"2023-05-23","4",null,null,null,null,null,""]
[9,"2023-05-24","5",null,null,null,null,null,""]
[10,"2023-05-25","6",null,null,null,null,null,""]
[11,"2023-05-26","7",null,null,null,null,null,""]
[12,"2023-05-29","8",null,null,null,null,null,""]
[13,"2023-05-30","9",null,null,null,null,null,""]
[14,"2023-05-31","10",null,null,null,null,null,""]
[15,"2023-06-01","11",null,null,null,null,null,""]
[16,"2023-06-02","12",null,null,null,null,null,""]
[17,"2023-06-05","13",null,null,null,null,null,""]
[18,"2023-06-06","14",null,null,null,null,null,""]
[19,"2023-06-07","15",null,null,null,null,null,""]
[20,"2023-06-08","16",null,null,null,null,null,""]
[21,"2023-06-09","17",null,null,null,null,null,""]
[22,"2023-06-12","18",null,null,null,null,null,""]
[23,"2023-06-13","19",null,null,null,null,null,""]
[24,"2023-06-14","20",null,null,null,null,null,""]
[25,"2023-06-15","21",null,null,null,null,null,""]
[26,"2023-06-16","22",null,null,null,null,null,""]
[27,"2023-06-19","23",null,null,null,null,null,""]
[28,"2023-06-20","24",null,null,null,null,null,""]
[29,"2023-06-21","25",null,null,null,null,null,""]
{"$rows_left_out":31}
{"sheet":"Formatting","index":3,"n_rows":568,"n_cols":51,"rows_kept":568,"cut":false,"hidden":true,"merged":[[1,1,1,3]]}
["2023-05-17T14:04:29",null,null,null,null,"Shaded Areas",null,null,null,null,null,null,null,"Gridlines & date labels",null,null,null,null,{"$f":"_xlfn.SINGLE(BufferDays)","v":"14"},null,null,null,null,"AvailableTracks","SelectedTracks","updateSelected",null,"DateRunFrom0",{"$f":"NETWORKDAYS(ProjectStartDate, DateRun)","v":1},"firstpoint",{"$f":"INDEX(MainData!$N$58:$N$842,MATCH(TRUE,MainData!$N$58:$N$842<>\"\",0))","v":{"$error":"#N/A"}},"firstdate",{"$f":"INDEX(MainData!$A$5:$A$842,MATCH(TRUE,MainData!$C$5:$C$842<>\"\",0))","v":"2023-07-31"},"Todaypoint",{"$f":"INDEX(MainData!$N$58:$N$842,TodayRow,0)","v":0},null,null,"fixedName","CodeName","visibleName"]
[null,"Chart Scaling (Automatic)",null,null,null,null,null,"Ahead","OK","Warning","Danger","Blown",null,{"$f":"xMax","v":53},{"$f":"BufferEndDate+AboveBufferChartDays","v":45138},{"$f":"LeftMin","v":0},{"$f":"WORKDAY(APIData!G3,-BelowZeroChartDays-1)","v":"2023-07-11"},null,null,null,null,null,null,"Prototype 1 ready for testing","Prototype 1 ready for testing",true,null,"Projection Periods","change","timespan","slope","X","Y",null,"ShowOptions","Shown",null,"y","Sheet1","Chart"]
[null,null,"X-Axis","Left Y-Axis",null,"X-Axis","X-Axis 2010","Y-Axis","Y-Axis","Y-Axis","Y-Axis","Y-Axis",null,{"$f":"N2","v":53},{"$f":"BufferEndDate+AboveBufferChartDays","v":45138},{"$f":"P2+LeftMajor","v":1},{"$f":"WORKDAY(Q2,LeftMajor)","v":"2023-07-12"},null,null,null,null,null,null,null,null,null,null,"Whole Project",{"$f":"AI1-AE1","v":{"$error":"#N/A"}},{"$f":"NETWORKDAYS(AG1,DateRun)-1","v":-55},{"$f":"AC3/AD3","v":{"$error":"#N/A"}},{"$f":"MATCH(TRUE,APIData!$H$842<>\"\",0)-1","v":{"$error":"#N/A"}},{"$f":"AE1","v":{"$error":"#N/A"}},null,"Legend",false,null,"y","Sheet2","APIData"]
[null,"Max",{"$f":"MAX(F4:F10)","v":53},{"$f":"BufferDays+AboveBufferChartDays","v":14},null,{"$f":"-0.1","v":-0.1},{"$f":"ProjectStartDate-0.01","v":45062.99},0,{"$f":"GreenOnDay0-((BufferDays-GreenOnDay0-RedOnLastDay-WarningSize)/(BufferEndDate-ProjectStartDate))","v":1.8933333333333333},{"$f":"I4+WarningSize","v":3.8933333333333335},{"$f":"VALUE(BufferDays)","v":14},1000,null,{"$f":"N3","v":53},{"$f":"BufferEndDate+AboveBufferChartDays","v":45138},2,"2023-07-13",null,null,null,null,null,null,null,null,null,null,null,{"$f":"WORKDAY(DateRun,(NETWORKDAYS(DateRun,ProjectUnBufferredEndDate)-1)/(1-AE3))","v":{"$error":"#VALUE!"}},null,null,{"$f":"$AC$1","v":1},{"$f":"INDEX(APIData!$N$1:$N$842,TodayRow,0)","v":"Latest Milestone"},null,"Finish Line",true,null,"y","Sheet3","Formatting"]
[null,"Min",{"$f":"0","v":0},{"$f":"-BelowZeroChartDays","v":0},null,{"$f":"NETWORKDAYS(ProjectStartDate,BufferEndDate)-1","v":53},{"$f":"BufferEndDate+AboveBufferChartDays","v":45138},0,{"$f":"BufferDays-RedOnLastDay-WarningSize","v":10},{"$f":"I5+WarningSize","v":12},14,1000,null,53,{"$f":"BufferEndDate+AboveBufferChartDays","v":45138},3,"2023-07-14",null,null,null,null,null,null,null,null,null,null,null,{"$f":"WORKDAY(ProjectStartDate,(INTERCEPT(AG3:AG4,AF3:AF4)-INTERCEPT(D27:D28,C27:C28))/((SLOPE(D27:D28,C27:C28)-SLOPE(AG3:AG4,AF3:AF4))))","v":{"$error":"#N/A"}},null,null,{"$f":"IF(SLOPE($D$27:$D$28,$C$27:$C$28)>SLOPE(AG3:AG4,AF3:AF4),(INTERCEPT(AG3:AG4,AF3:AF4)-INTERCEPT($D$27:$D$28,$C$27:$C$28)) / ((SLOPE($D$27:$D$28,$C$27:$C$28)-SLOPE(AG3:AG4,AF3:AF4))),$C$28)","v":{"$error":"#N/A"}},{"$f":" $AG$4 + (AF5-$AF$4)*AE3","v":{"$error":"#VALUE!"}},{"$f":"CONCATENATE(AB3,\" Trajectory (\",TEXT(AC4,DateFormatText),\")\")","v":{"$error":"#VALUE!"}},null,null,null,"y","Sheet4","MainData"]
[null,"Crosses",{"$f":"0","v":0},{"$f":"-BelowZeroChartDays","v":0},null,{"$f":"F5+AboveBufferChartDays","v":53},{"$f":"BufferEndDate+AboveBufferChartDays","v":45138},0,{"$f":"I5","v":10},{"$f":"I6+WarningSize","v":12},14,1000,null,53,{"$f":"BufferEndDate+AboveBufferChartDays","v":45138},4,"2023-07-17"]
[null,"Major Axes",5,{"$f":"ROUNDUP((LeftMax-LeftMin)/20,0)","v":1},null,{"$f":"F6","v":53},{"$f":"BufferEndDate+AboveBufferChartDays","v":45138},0,{"$f":"I6","v":10},{"$f":"J6","v":12},14,{"$f":"L6","v":1000},null,53,{"$f":"BufferEndDate+AboveBufferChartDays","v":45138},5,"2023-07-18",null,null,null,null,null,null,null,null,null,null,{"$f":"Chart!K5","v":5},{"$f":"$AI$1-INDEX(MainData!$N$58:$N$842,MATCH(MAX($AG$1,WORKDAY(DateRun,-AB7)),MainData!$A$5:$A$842,0),0)","v":0},{"$f":"AB7","v":5},{"$f":"AC7/AD7","v":0},{"$f":"MAX(0,$AC$1-AD7)","v":0},{"$f":"INDEX(MainData!$N$58:$N$842,MATCH(AF7,MainData!$B$2:$B$842,0),0)","v":0}]
[null,null,"=CHOOSE(ROUND((NETWORKDAYS(ProjectStartDate,BufferEndDate)-1)/40,0),5,5,5,10,10,20,20,20,20,20,20,20,20,20,20,40,40,40,40,40,40)","=CHOOSE(ROUNDUP((LeftMax-LeftMin)/20,0),1,1,5,5,5,10,20,20,20,20,20,20,20,20,20,20,20,20)",null,{"$f":"F7","v":53},{"$f":"BufferEndDate+AboveBufferChartDays","v":45138},0,{"$f":"I7","v":10},12,14,1000,null,53,{"$f":"BufferEndDate+AboveBufferChartDays","v":45138},6,"2023-07-19",null,null,null,null,null,null,null,null,null,null,null,{"$f":"WORKDAY(DateRun,ROUNDUP((NETWORKDAYS(DateRun,ProjectUnBufferredEndDate)-1)/(1-AE7),0))","v":{"$error":"#VALUE!"}},null,null,{"$f":"$AC$1","v":1},{"$f":"VLOOKUP(9999,MainData!$A$1:$CK$357,5,FALSE)","v":{"$error":"#N/A"}}]
["Buffer End Line","Buffer End",{"$f":"NETWORKDAYS(ProjectStartDate,BufferEndDate)-1","v":53},{"$f":"D5","v":0},null,53,{"$f":"BufferEndDate+AboveBufferChartDays","v":45138},0,10,12,14,1000,null,53,{"$f":"BufferEndDate+AboveBufferChartDays","v":45138},7,"2023-07-20",null,null,null,null,null,null,null,null,null,null,null,null,null,null,{"$f":"IF(SLOPE($D$27:$D$28,$C$27:$C$28)>SLOPE(AG7:AG8,AF7:AF8),(INTERCEPT(AG7:AG8,AF7:AF8)-INTERCEPT($D$27:$D$28,$C$27:$C$28)) / ((SLOPE($D$27:$D$28,$C$27:$C$28)-SLOPE(AG7:AG8,AF7:AF8))),$C$28)","v":{"$error":"#N/A"}},{"$f":" $AG$8 + (AF9-$AF$8)*($AG$8-$AG$7)/($AF$8-$AF$7)","v":{"$error":"#N/A"}},{"$f":"CONCATENATE(AB7,\" Day Trajectory (\",IFERROR(TEXT(AC8,DateFormatText),\"\"),\")\")","v":"5 Day Trajectory ()"}]
[null,null,{"$f":"NETWORKDAYS(ProjectStartDate,BufferEndDate)-1","v":53},{"$f":"D4","v":14},null,53,{"$f":"BufferEndDate+AboveBufferChartDays","v":45138},0,10,12,14,1000,null,53,{"$f":"BufferEndDate+AboveBufferChartDays","v":45138},8,"2023-07-21"]
[null,null,null,null,null,53,{"$f":"BufferEndDate+AboveBufferChartDays","v":45138},0,10,12,14,1000,null,53,{"$f":"BufferEndDate+AboveBufferChartDays","v":45138},9,"2023-07-24",null,null,null,null,null,null,null,null,null,null,{"$f":"Chart!K6","v":10},{"$f":"$AI$1-INDEX(MainData!$N$58:$N$842,MATCH(MAX($AG$1,WORKDAY(DateRun,-AB11)),MainData!$A$5:$A$842,0),0)","v":0},{"$f":"AB11","v":10},{"$f":"AC11/AD11","v":0},{"$f":"$AC$1-AD11","v":-9},{"$f":"INDEX(MainData!$N$58:$N$842,MATCH(AF11,MainData!$B$2:$B$842,0),0)","v":{"$error":"#N/A"}}]
[null,"Date Format Text","m/d/yyyy",null,null,53,{"$f":"BufferEndDate+AboveBufferChartDays","v":45138},0,10,12,14,1000,null,53,{"$f":"BufferEndDate+AboveBufferChartDays","v":45138},10,"2023-07-25",null,null,null,null,null,null,null,null,null,null,null,{"$f":"WORKDAY(DateRun,ROUNDUP((NETWORKDAYS(DateRun,ProjectUnBufferredEndDate)-1)/(1-AE11),0))","v":{"$error":"#VALUE!"}},null,null,{"$f":"$AC$1","v":1},{"$f":"VLOOKUP(9999,MainData!$A$1:$CK$357,5,FALSE)","v":{"$error":"#N/A"}}]
[null,null,null,null,null,53,{"$f":"BufferEndDate+AboveBufferChartDays","v":45138},0,10,12,14,1000,null,53,{"$f":"BufferEndDate+AboveBufferChartDays","v":45138},11,"2023-07-26",null,null,null,null,null,null,null,null,null,null,null,null,null,null,{"$f":"IF(SLOPE($D$27:$D$28,$C$27:$C$28)>SLOPE(AG11:AG12,AF11:AF12),(INTERCEPT(AG11:AG12,AF11:AF12)-INTERCEPT($D$27:$D$28,$C$27:$C$28)) / ((SLOPE($D$27:$D$28,$C$27:$C$28)-SLOPE(AG11:AG12,AF11:AF12))),$C$28)","v":{"$error":"#N/A"}},{"$f":" $AG$12 + (AF13-$AF$12)*($AG$12-$AG$11)/($AF$12-$AF$11)","v":{"$error":"#N/A"}},{"$f":"CONCATENATE(AB11,\" Day Trajectory (\",IFERROR(TEXT(AC12,DateFormatText),\"\"),\")\")","v":"10 Day Trajectory ()"}]
[null,"pace car point",null,null,null,53,{"$f":"BufferEndDate+AboveBufferChartDays","v":45138},0,10,12,14,1000,null,53,{"$f":"BufferEndDate+AboveBufferChartDays","v":45138},12,"2023-07-27",null,null,null,null,null,null,null,null,null,{"$f":"IFERROR(INDEX(SeriesNames,SMALL(IF(LEN(SeriesNames)>1,ROW(SeriesNames)-3),ROW(14:14)-3),1),\"\")","v":""}]
[null,{"$f":"NETWORKDAYS(BufferStartDate,GreenYellowDate)","v":2},null,null,null,53,{"$f":"BufferEndDate+AboveBufferChartDays","v":45138},0,10,12,14,1000,null,53,{"$f":"BufferEndDate+AboveBufferChartDays","v":45138},13,"2023-07-28",null,null,null,null,null,null,null,null,null,{"$f":"IFERROR(INDEX(SeriesNames,SMALL(IF(LEN(SeriesNames)>1,ROW(SeriesNames)-3),ROW(15:15)-3),1),\"\")","v":""},{"$f":"NETWORKDAYS(MAX(Chart!K7,ProjectStartDate),DateRun)-1","v":1506},{"$f":"$AI$1-INDEX(MainData!$N$58:$N$842,MATCH(MAX($AG$1,WORKDAY(DateRun,-AB15)),MainData!$A$5:$A$842,0),0)","v":0},{"$f":"AB15","v":1506},{"$f":"AC15/AD15","v":0},{"$f":"$AC$1-AD15","v":-1505},{"$f":"INDEX(MainData!$E$2:$E$842,MATCH(AF15,MainData!$C$2:$C$842,0),0)","v":{"$error":"#N/A"}}]
[null,"dateRunFormatted",{"$f":"TEXT(DATEVALUE(DateRun),DateFormatText) & \" \" & TEXT(TIMEVALUE(DateRun),\"HH:MM\")","v":"5/17/2023 16:44"},null,null,53,{"$f":"BufferEndDate+AboveBufferChartDays","v":45138},0,10,12,14,1000,null,53,{"$f":"BufferEndDate+AboveBufferChartDays","v":45138},14,"2023-07-31",null,null,null,null,null,null,null,null,null,{"$f":"IFERROR(INDEX(SeriesNames,SMALL(IF(LEN(SeriesNames)>1,ROW(SeriesNames)-3),ROW(16:16)-3),1),\"\")","v":""},null,{"$f":"WORKDAY(DateRun,ROUNDUP((NETWORKDAYS(DateRun,ProjectUnBufferredEndDate)-1)/(1-AE15),0))","v":{"$error":"#VALUE!"}},null,null,{"$f":"$AC$1","v":1},{"$f":"VLOOKUP(9999,MainData!$A$1:$CK$357,5,FALSE)","v":{"$error":"#N/A"}}]
[null,"todayrow",{"$f":"IF(MATCH(DATEVALUE(LEFT(DateRun,10)), MainData[Reporting Date], 1)=1,2,MATCH(DATEVALUE(LEFT(DateRun,10)), MainData[Reporting Date], 1)+1)","v":2},null,null,53,{"$f":"BufferEndDate+AboveBufferChartDays","v":45138},0,10,12,14,1000,null,53,{"$f":"BufferEndDate+AboveBufferChartDays","v":45138},15,"2023-08-01",null,null,null,null,null,null,null,null,null,{"$f":"IFERROR(INDEX(SeriesNames,SMALL(IF(LEN(SeriesNames)>1,ROW(SeriesNames)-3),ROW(17:17)-3),1),\"\")","v":""},null,null,null,null,{"$f":"IF(SLOPE($D$27:$D$28,$C$27:$C$28)>SLOPE(AG15:AG16,AF15:AF16),(INTERCEPT(AG15:AG16,AF15:AF16)-INTERCEPT($D$27:$D$28,$C$27:$C$28)) / ((SLOPE($D$27:$D$28,$C$27:$C$28)-SLOPE(AG15:AG16,AF15:AF16))),$C$28)","v":{"$error":"#N/A"}},{"$f":" $AG$16 + (AF17-$AF$16)*($AG$16-$AG$15)/($AF$16-$AF$15)","v":{"$error":"#N/A"}},{"$f":"CONCATENATE(\"Trajectory From \",IFERROR(TEXT(Chart!K7,DateFormatText),\"\"),\" (\",IFERROR(TEXT(AC16,DateFormatText),\"\"),\")\")","v":"Trajectory From 8/8/2017 ()"}]
[null,"APICall","APIBufferReport2b",null,null,53,{"$f":"BufferEndDate+AboveBufferChartDays","v":45138},0,10,12,14,1000,null,53,{"$f":"BufferEndDate+AboveBufferChartDays","v":45138},16,"2023-08-02",null,null,null,null,null,null,null,null,null,{"$f":"IFERROR(INDEX(SeriesNames,SMALL(IF(LEN(SeriesNames)>1,ROW(SeriesNames)-3),ROW(18:18)-3),1),\"\")","v":""}]
[null,null,null,null,null,53,{"$f":"BufferEndDate+AboveBufferChartDays","v":45138},0,10,12,14,1000,null,53,{"$f":"BufferEndDate+AboveBufferChartDays","v":45138},17,"2023-08-03",null,null,null,null,null,null,null,null,null,{"$f":"IFERROR(INDEX(SeriesNames,SMALL(IF(LEN(SeriesNames)>1,ROW(SeriesNames)-3),ROW(19:19)-3),1),\"\")","v":""}]
[null,null,null,null,null,53,{"$f":"BufferEndDate+AboveBufferChartDays","v":45138},0,10,12,14,1000,null,53,{"$f":"BufferEndDate+AboveBufferChartDays","v":45138},18,"2023-08-04",null,null,null,null,null,null,null,null,null,{"$f":"IFERROR(INDEX(SeriesNames,SMALL(IF(LEN(SeriesNames)>1,ROW(SeriesNames)-3),ROW(20:20)-3),1),\"\")","v":""}]
[null,"Completion Target Date",{"$f":"WORKDAY(BufferEndDate,1)","v":"2023-08-01"},null,null,53,{"$f":"BufferEndDate+AboveBufferChartDays","v":45138},0,10,12,14,1000,null,53,{"$f":"BufferEndDate+AboveBufferChartDays","v":45138},19,"2023-08-07",null,null,null,null,null,null,null,null,null,{"$f":"IFERROR(INDEX(SeriesNames,SMALL(IF(LEN(SeriesNames)>1,ROW(SeriesNames)-3),ROW(21:21)-3),1),\"\")","v":""}]
[null,null,null,null,null,53,{"$f":"BufferEndDate+AboveBufferChartDays","v":45138},0,10,12,14,1000,null,53,{"$f":"BufferEndDate+AboveBufferChartDays","v":45138},20,"2023-08-08",null,null,null,null,null,null,null,null,null,{"$f":"IFERROR(INDEX(SeriesNames,SMALL(IF(LEN(SeriesNames)>1,ROW(SeriesNames)-3),ROW(22:22)-3),1),\"\")","v":""},null,null,null,null,null,null,null,"Buffer End Line",true]
[null,null,null,null,null,53,{"$f":"BufferEndDate+AboveBufferChartDays","v":45138},0,10,12,14,1000,null,53,{"$f":"BufferEndDate+AboveBufferChartDays","v":45138},21,"2023-08-09",null,null,null,null,null,null,null,null,null,{"$f":"IFERROR(INDEX(SeriesNames,SMALL(IF(LEN(SeriesNames)>1,ROW(SeriesNames)-3),ROW(23:23)-3),1),\"\")","v":""},null,null,null,null,null,null,null,"Whole Project Trajectory",false]
["Finish Line 2010","Intersection Line",{"$f":"WORKDAY(BufferStartDate,-1)+LeftMin","v":45118},{"$f":"D27","v":0},null,53,{"$f":"BufferEndDate+AboveBufferChartDays","v":45138},0,10,12,14,1000,null,53,{"$f":"BufferEndDate+AboveBufferChartDays","v":45138},22,"2023-08-10",null,null,null,null,null,null,null,null,null,{"$f":"IFERROR(INDEX(SeriesNames,SMALL(IF(LEN(SeriesNames)>1,ROW(SeriesNames)-3),ROW(24:24)-3),1),\"\")","v":""},null,null,null,null,null,null,null,"Min Trajectory",false]
[null,null,{"$f":"BufferEndDate+AboveBufferChartDays","v":45138},{"$f":"D10","v":14},{"$f":"C25","v":"2023-07-31"},53,{"$f":"BufferEndDate+AboveBufferChartDays","v":45138},0,10,12,14,1000,null,53,{"$f":"BufferEndDate+AboveBufferChartDays","v":45138},23,"2023-08-11",null,null,null,null,{"$f":"IF(U25=\"\",\"\",VLOOKUP(U25,SeriesAll,2,FALSE))","v":""},null,null,null,null,{"$f":"IFERROR(INDEX(SeriesNames,SMALL(IF(LEN(SeriesNames)>1,ROW(SeriesNames)-3),ROW(25:25)-3),1),\"\")","v":""},null,null,null,null,null,null,null,"Max Trajectory",false]
[null,null,null,null,null,53,{"$f":"BufferEndDate+AboveBufferChartDays","v":45138},0,10,12,14,1000,null,53,{"$f":"BufferEndDate+AboveBufferChartDays","v":45138},24,"2023-08-14",null,null,null,null,null,null,null,null,null,null,null,null,null,null,null,null,null,"Specific Date Trajectory",false]
["Finish Line 2013","Intersection Line",{"$f":"NETWORKDAYS(ProjectStartDate,WORKDAY(BufferStartDate,-1))+LeftMin","v":40},{"$f":"D5","v":0},null,53,{"$f":"BufferEndDate+AboveBufferChartDays","v":45138},0,10,12,14,1000]
[null,null,{"$f":"xMax","v":53},{"$f":"D10","v":14},null,53,{"$f":"BufferEndDate+AboveBufferChartDays","v":45138},0,10,12,14,1000,null,null,null,null,null,null,null,null,null,null,null,null,null,null,null,null,null,null,null,null,null,null,null,"report types",null,null,"Finish Task Designation","instructions?","has instructions?",null,null,"Tracks to Chart","instructions?","has instructions?"]
[null,null,null,null,null,53,{"$f":"BufferEndDate+AboveBufferChartDays","v":45138},0,10,12,14,1000,null,null,null,null,null,null,null,null,null,null,null,null,null,null,null,null,null,null,null,null,null,null,null,"Designated Milestone/Task","Designated Milestones/Tasks","in same project as buffer","The Major Milestone in Same Summary as Buffer Task","to the description of the buffer task and milestones/tasks to track in the chart",true,1,null,"Designated Milestones/Tasks","to the description of the buffer task and milestones/tasks to track in the chart",true,1,null,"in same project as buffer",null,1]
[null,null,null,null,null,53,{"$f":"BufferEndDate+AboveBufferChartDays","v":45138},0,10,12,14,1000,null,null,null,null,null,null,null,null,null,null,null,null,null,null,null,null,null,{"$f":"WORKDAY(DateRun,ROUND((NETWORKDAYS(DateRun,ProjectUnBufferredEndDate))/(1-AE3),0))","v":{"$error":"#VALUE!"}},null,null,null,null,null,{"$f":"VLOOKUP(AJ29,AM29:AP33,4,FALSE)","v":2},{"$f":"VLOOKUP(AK29,AR29:AU33,4,FALSE)","v":1},{"$f":"VLOOKUP(AL29,AW29:AZ33,3,FALSE)","v":1},"Designated Milestone/Task","to the description of the buffer task and milestones/tasks to track in the chart",true,2,null,"A designated task and its direct predecessors","to the description of the buffer task and milestones/tasks to track in the chart",true,2,null,"in same summary task as buffer",null,2]
{"$rows_left_out":538}